Reaction Details
TargetHistone deacetylase 3
LigandBDBM24622
Substrate/Competitorn/a
Meas. Tech.ChEBML_1684724
Ki 10.0±n/a nM
Citation De Vreese, RD'hooghe, M Synthesis and applications of benzohydroxamic acid-based histone deacetylase inhibitors. Eur J Med Chem135:174-195 (2017) 
 
Histone deacetylase 3
Name:Histone deacetylase 3
Type:Enzyme
Mol. Mass.:48829.55
Organism:Homo sapiens (Human)
Description:O15379
Residue:428
BDBM24622
NameBDBM24622
Synonyms:3-[(dimethylamino)methyl]-N-{2-[4-(hydroxycarbamoyl)phenoxy]ethyl}-1-benzofuran-2-carboxamide | CRA-024781
TypeSmall organic molecule
Emp. Form.C21H23N3O5
Mol. Mass.397.4244
SMILESCN(C)Cc1c(oc2ccccc12)C(=O)NCCOc1ccc(cc1)C(=O)NO