Reaction Details
TargetSerotonin 2 (5-HT2) receptor
LigandBDBM50007170
Substrate/Competitorn/a
Meas. Tech.ChEMBL_2336 (CHEMBL617543)
Ki 34±n/a nM
Citation Raghupathi, RKRydelek-Fitzgerald, LTeitler, MGlennon, RA Analogues of the 5-HT1A serotonin antagonist 1-(2-methoxyphenyl)-4-[4-(2-phthalimido)butyl]piperazine with reduced alpha 1-adrenergic affinity. J Med Chem34:2633-8 (1991) Serotonin 2 (5-HT2) receptor
Name:Serotonin 2 (5-HT2) receptor
Synonyms:5-hydroxytryptamine receptor 2A/2B/2C
Type:n/a
Mol. Mass.:n/a
Description:ASSAY_ID of ChEMBL is 2197419
Components:This complex has 3 components.
Component 1
Name:5-hydroxytryptamine receptor 2B
Type:Enzyme Catalytic Domain
Mol. Mass.:53668.47
Organism:RAT
Description:5-HT2B HTR2B RAT::P30994
Residue:479
Component 2
Name:5-hydroxytryptamine receptor 2C
Synonyms:5-HT2C 5-hydroxytryptamine receptor 2C (5HT2c) 5ht1c Htr2c Serotonin receptor 2a and 2c (5HT2A and 5HT2C)
Type:Enzyme
Mol. Mass.:51935.10
Organism:Rattus norvegicus (Rat)
Description:P08909
Residue:460
Component 3
Name:5-hydroxytryptamine receptor 2A
Synonyms:5-HT-2A 5-HT2A 5-hydroxytryptamine receptor 2A (5HT2A) Htr2 Serotonin Receptor 2A
Type:G Protein-Coupled Receptor (GPCR)
Mol. Mass.:52852.05
Organism:Rattus norvegicus (rat)
Description:Rat cortex membranes 5-HT2A receptors.
Residue:471
BDBM50007170
NameBDBM50007170
Synonyms:Adamantane-1-carboxylic acid {4-[4-(2-methoxy-phenyl)-piperazin-1-yl]-butyl}-amide | CHEMBL26533
TypeSmall organic molecule
Emp. Form.C26H39N3O2
Mol. Mass.425.6068
SMILESCOc1ccccc1N1CCN(CCCCNC(=O)C23C[C@H]4C[C@H](C[C@H](C4)C2)C3)CC1