Reaction Details
TargetAtrial natriuretic peptide receptor 3
LigandBDBM50254061
Substrate/Competitorn/a
Meas. Tech.ChEBML_1686038
IC50 0.140000±n/a nM
Citation Nishizawa, NNakamura, GNoguchi, YNakagawa, HShimizu, ANakayama, MTakekawa, SAsami, T A potent and selective natriuretic peptide receptor-3 blocker 11-mer peptide created by hybridization of musclin and atrial natriuretic peptide. Bioorg Med Chem Lett27:3542-3545 (2017) 
 
Atrial natriuretic peptide receptor 3
Name:Atrial natriuretic peptide receptor 3
Type:PROTEIN
Mol. Mass.:59805.12
Organism:Homo sapiens (Human)
Description:ChEMBL_34991
Residue:541
BDBM50254061
NameBDBM50254061
Synonyms:CHEMBL4089530
TypeSmall organic molecule
Emp. Form.C62H99N15O15
Mol. Mass.1294.541
SMILESCC[C@H](C)[C@H](NC(=O)[C@H](CCCNC(=N)NC)NC(=O)[C@H](CC(O)=O)NC(=O)[C@@H](NC(=O)[C@@H]1CCCN1C(=O)CNC(=O)[C@@H](C)NC(=O)[C@H](CC1CCCCC1)NC(=O)[C@H]1CCCN1C(=O)[C@H](CO)NC(=O)[C@@H](Cc1ccccc1)NC(C)=O)[C@@H](C)CC)C(=O)NC