Reaction Details
TargetLysosomal acid glucosylceramidase
LigandBDBM50254109
Substrate/Competitorn/a
Meas. Tech.ChEBML_1686054
Ki 19±n/a nM
Citation Schalli, MWeber, PTysoe, CPabst, BMThonhofer, MPaschke, EStütz, AETschernutter, MWindischhofer, WWithers, SG A new type of pharmacological chaperone for G Bioorg Med Chem Lett27:3431-3435 (2017) 
 
Lysosomal acid glucosylceramidase
Name:Lysosomal acid glucosylceramidase
Type:Enzyme
Mol. Mass.:59724.64
Organism:Homo sapiens (Human)
Description:The beta-Glu activity was measured with commercially available beta-glucocerebrosidase (Ceredase) as the enzyme source.
Residue:536
BDBM50254109
NameBDBM50254109
Synonyms:CHEMBL4069909
TypeSmall organic molecule
Emp. Form.C24H37N3O6S
Mol. Mass.495.632
SMILESCN(C)c1cccc2c(cccc12)S(=O)(=O)NCCCCCCN[C@H]1[C@H](O)[C@@H](O)[C@@H](O)[C@H]1CO