Reaction Details
TargetLysine-specific histone demethylase 1A
LigandBDBM50075571
Substrate/Competitorn/a
Meas. Tech.ChEBML_1686155
IC50 1820±n/a nM
Citation Ding, LWang, ZZSun, XDYang, JMa, CYLi, WLiu, HM 3D-QSAR (CoMFA, CoMSIA), molecular docking and molecular dynamics simulations study of 6-aryl-5-cyano-pyrimidine derivatives to explore the structure requirements of LSD1 inhibitors. Bioorg Med Chem Lett27:3521-3528 (2017) 
 
Lysine-specific histone demethylase 1A
Name:Lysine-specific histone demethylase 1A
Type:Enzyme
Mol. Mass.:92901.01
Organism:Homo sapiens (Human)
Description:O60341
Residue:852
BDBM50075571
NameBDBM50075571
Synonyms:CHEMBL3415355
TypeSmall organic molecule
Emp. Form.C15H11FN6S2
Mol. Mass.358.416
SMILESNC(=S)NNc1nc(SCC#C)nc(-c2ccc(F)cc2)c1C#N