Reaction Details
TargetBeta-1 adrenergic receptor
LigandBDBM50007478
Substrate/Competitorn/a
Meas. Tech.ChEBML_37546
Ki 87000±n/a nM
Citation Adejare, ANie, JYHebel, DBrackett, LEChoi, OGusovsky, FPadgett, WLDaly, JWCreveling, CRKirk, KL Effect of fluorine substitution on the adrenergic properties of 3-(tert-butylamino)-1-(3,4-dihydroxyphenoxy)-2-propanol. J Med Chem34:1063-8 (1991) Beta-1 adrenergic receptor
Name:Beta-1 adrenergic receptor
Type:Protein
Mol. Mass.:50486.84
Organism:Rattus norvegicus (Rat)
Description:P18090
Residue:466
BDBM50007478
NameBDBM50007478
Synonyms:4-(3-tert-Butylamino-2-hydroxy-propoxy)-5-fluoro-benzene-1,2-diol | CHEMBL10494
TypeSmall organic molecule
Emp. Form.C13H20FNO4
Mol. Mass.273.3006
SMILESCC(C)(C)NCC(O)COc1cc(O)c(O)cc1F