Reaction Details
TargetAcetylcholinesterase
LigandBDBM50254293
Substrate/Competitorn/a
Meas. Tech.ChEMBL_1686268 (CHEMBL4036747)
Ki 80000±n/a nM
Citation Yoder, RJZhuang, QBeck, JMFranjesevic, ABlanton, TGSillart, SSecor, TGuerra, LBrown, JDReid, CMcElroy, CADo?an Ekici, ÖCallam, CSHadad, CM Study of ACS Med Chem Lett8:622-627 (2017) 
 
Acetylcholinesterase
Name:Acetylcholinesterase
Type:Enzyme
Mol. Mass.:71812.79
Organism:Electrophorus electricus (Electric eel)
Description:n/a
Residue:633
BDBM50254293
NameBDBM50254293
Synonyms:CHEMBL4070283
TypeSmall organic molecule
Emp. Form.C10H16ClNO2
Mol. Mass.217.693
SMILESCl.COc1cc(CN(C)C)ccc1O