Reaction Details
TargetSubstance-K receptor
LigandBDBM50007825
Substrate/Competitorn/a
Meas. Tech.ChEBML_209224
EC50 2.7±n/a nM
Citation Ward, PEwan, GBJordan, CCIreland, SJHagan, RMBrown, JR Potent and highly selective neurokinin antagonists. J Med Chem33:1848-51 (1990) Substance-K receptor
Name:Substance-K receptor
Type:Enzyme Catalytic Domain
Mol. Mass.:43868.63
Organism:Rattus norvegicus (Rat)
Description:Neurokinin NK2 TACR2 Murine::P16610
Residue:390
BDBM50007825
NameBDBM50007825
Synonyms:2-(2-{2-[2-(4-Amino-butyrylamino)-3-phenyl-propionylamino]-3-phenyl-propionylamino}-propionylamino)-4-methyl-pentanoic acid (1-carbamoyl-3-methylsulfanyl-propyl)-amide | CHEMBL291903
TypeSmall organic molecule
Emp. Form.C36H53N7O6S
Mol. Mass.711.914
SMILESCSCC[C@H](NC(=O)[C@H](CC(C)C)NC(=O)[C@@H](C)NC(=O)[C@H](Cc1ccccc1)NC(=O)[C@H](Cc1ccccc1)NC(=O)CCCN)C(N)=O