Reaction Details
TargetSubstance-K receptor
LigandBDBM50007827
Substrate/Competitorn/a
Meas. Tech.ChEBML_209224
EC50 0.400000±n/a nM
Citation Ward, PEwan, GBJordan, CCIreland, SJHagan, RMBrown, JR Potent and highly selective neurokinin antagonists. J Med Chem33:1848-51 (1990) Substance-K receptor
Name:Substance-K receptor
Type:Enzyme Catalytic Domain
Mol. Mass.:43868.63
Organism:Rattus norvegicus (Rat)
Description:Neurokinin NK2 TACR2 Murine::P16610
Residue:390
BDBM50007827
NameBDBM50007827
Synonyms:2-(3-{2-[2-(4-Amino-butyrylamino)-3-phenyl-propionylamino]-3-phenyl-propionylamino}-2-oxo-pyrrolidin-1-yl)-4-methyl-pentanoic acid (1-carbamoyl-3-methylsulfanyl-propyl)-amide | CHEMBL301841
TypeSmall organic molecule
Emp. Form.C37H53N7O6S
Mol. Mass.723.925
SMILESCSCC[C@H](NC(=O)[C@@H](CC(C)C)N1CCC(NC(=O)[C@H](Cc2ccccc2)NC(=O)[C@H](Cc2ccccc2)NC(=O)CCCN)C1=O)C(N)=O