Reaction Details
TargetSubstance-K receptor
LigandBDBM50007823
Substrate/Competitorn/a
Meas. Tech.ChEBML_209224
EC50 188±n/a nM
Citation Ward, PEwan, GBJordan, CCIreland, SJHagan, RMBrown, JR Potent and highly selective neurokinin antagonists. J Med Chem33:1848-51 (1990) Substance-K receptor
Name:Substance-K receptor
Type:Enzyme Catalytic Domain
Mol. Mass.:43868.63
Organism:Rattus norvegicus (Rat)
Description:Neurokinin NK2 TACR2 Murine::P16610
Residue:390
BDBM50007823
NameBDBM50007823
Synonyms:1-{2-[2-(4-Amino-butyrylamino)-3-phenyl-propionylamino]-3-phenyl-propionyl}-pyrrolidine-2-carboxylic acid [1-(1-carbamoyl-3-methylsulfanyl-propylcarbamoyl)-3-methyl-butyl]-amide | CHEMBL2372953
TypeSmall organic molecule
Emp. Form.C38H55N7O6S
Mol. Mass.737.952
SMILESCSCC[C@@H](NC(=O)[C@H](CC(C)C)NC(=O)[C@@H]1CCCN1C(=O)[C@H](Cc1ccccc1)NC(=O)[C@H](Cc1ccccc1)NC(=O)CCCN)C(N)=O