Reaction Details
TargetSodium/potassium-transporting ATPase subunit alpha-4/beta-3
LigandBDBM50286739
Substrate/Competitorn/a
Meas. Tech.ChEBML_1686867
IC50 1.8±n/a nM
Citation Syeda, SSSánchez, GHong, KHHawkinson, JEGeorg, GIBlanco, G Design, Synthesis, and in Vitro and in Vivo Evaluation of Ouabain Analogues as Potent and Selective Na,K-ATPase?4 Isoform Inhibitors for Male Contraception. J Med Chem61:1800-1820 (2018) 
 
Sodium/potassium-transporting ATPase subunit alpha-4/beta-3
Name:Sodium/potassium-transporting ATPase subunit alpha-4/beta-3
Synonyms:N+/K+ ATPase alpha-4/beta-3
Type:n/a
Mol. Mass.:n/a
Description:ASSAY_ID of ChEMBL is 1686867
Components:This complex has 2 components.
Component 1
Name:Sodium/potassium-transporting ATPase subunit beta-3
Type:PROTEIN
Mol. Mass.:31833.84
Organism:Rattus norvegicus
Description:ChEMBL_117736
Residue:279
Component 2
Name:Sodium/potassium-transporting ATPase subunit alpha-4
Synonyms:3.6.3.9 Atp1a4 N+/K+ ATPase alpha-4/beta-3 Sodium pump subunit alpha-4 | Sodium/potassium-transporting ATPase subunit alpha-4
Type:PROTEIN
Mol. Mass.:113994.51
Organism:Rattus norvegicus
Description:ChEMBL_117736
Residue:1028
Component 3
Name:Sodium/potassium-transporting ATPase subunit beta-3
Synonyms:AT1B3_RAT Atp1b3 Sodium/potassium-dependent ATPase subunit beta-3 | Sodium/potassium-transporting ATPase subunit beta-3
Type:PROTEIN
Mol. Mass.:31833.84
Organism:Rattus norvegicus
Description:ChEMBL_117736
Residue:279
BDBM50286739
NameBDBM50286739
Synonyms:4-((1R,3S,5S,8R,10R,11R,13R,14S,17R)-1,5,11,14-tetrahydroxy-10-(hydroxymethyl)-13-methyl-3-((2R,3R,4R,5R,6S)-3,4,5-trihydroxy-6-methyl-tetrahydro-2H-pyran-2-yloxy)-hexadecahydro-1H-cyclopenta[a]phenanthren-17-yl)furan-2(5H)-one 4-[(1R,3S,5S,10R,11R,13R,14S,17R)-1,5,11,14-Tetrahydroxy-10-hydroxymethyl-13-methyl-3-((2R,3R,4R,5R,6S)-3,4,5-trihydroxy-6-methyl-tetrahydro-pyran-2-yloxy)-hexadecahydro-cyclopenta[a]phenanthren-17-yl]-5H-furan-2-one 4-[1,5,11,14-Tetrahydroxy-10-hydroxymethyl-13-methyl-3-(3,4,5-trihydroxy-6-methyl-tetrahydro-pyran-2-yloxy)-hexadecahydro-cyclopenta[a]phenanthren-17-yl]-5H-furan-2-one CHEMBL222863 Ouabain cid_439501
TypeSmall organic molecule
Emp. Form.C29H44O12
Mol. Mass.584.6525
SMILESC[C@@H]1O[C@@H](O[C@H]2C[C@@H](O)[C@]3(CO)[C@H]4[C@H](O)C[C@]5(C)[C@H](CC[C@]5(O)[C@@H]4CC[C@]3(O)C2)C2=CC(=O)OC2)[C@H](O)[C@H](O)[C@H]1O