Reaction Details
TargetSodium/potassium-transporting ATPase subunit alpha-3/beta-1
LigandBDBM50255109
Substrate/Competitorn/a
Meas. Tech.ChEBML_1686865
IC50>100000±n/a nM
Citation Syeda, SSSánchez, GHong, KHHawkinson, JEGeorg, GIBlanco, G Design, Synthesis, and in Vitro and in Vivo Evaluation of Ouabain Analogues as Potent and Selective Na,K-ATPase?4 Isoform Inhibitors for Male Contraception. J Med Chem61:1800-1820 (2018) 
 
Sodium/potassium-transporting ATPase subunit alpha-3/beta-1
Name:Sodium/potassium-transporting ATPase subunit alpha-3/beta-1
Synonyms:Na+/K+ ATPase alpha-3/beta-1
Type:n/a
Mol. Mass.:n/a
Description:ASSAY_ID of ChEMBL is 1686865
Components:This complex has 2 components.
Component 1
Name:Sodium/potassium-transporting ATPase subunit alpha-3
Type:PROTEIN
Mol. Mass.:111672.65
Organism:Rattus norvegicus
Description:ChEMBL_117719
Residue:1013
Component 2
Name:Sodium/potassium-transporting ATPase subunit beta-1
Synonyms:AT1B1_RAT N+/K+ ATPase alpha-4/beta-1 Sodium/potassium-transporting ATPase subunit beta-1
Type:PROTEIN
Mol. Mass.:35208.73
Organism:Rattus norvegicus
Description:ChEMBL_117735
Residue:304
BDBM50255109
NameBDBM50255109
Synonyms:CHEMBL4081196
TypeSmall organic molecule
Emp. Form.C28H39N3O6
Mol. Mass.513.6258
SMILES[H][C@@]12CC[C@]3(O)C[C@@H](O)C[C@@H](O)[C@]3(CO)[C@@]1([H])[C@H](O)C[C@]1(C)[C@H](CC[C@]21O)c1cn(Cc2ccccc2)nn1