Reaction Details
TargetGastrin/cholecystokinin type B receptor
LigandBDBM50007930
Substrate/Competitorn/a
Meas. Tech.ChEBML_48091
Ki 4300±n/a nM
Citation Gonzalez-Muniz, RBergeron, FMarseigne, IDurieux, CRoques, BP Boc-Trp-Orn(Z)-Asp-NH2 and derivatives: a new family of CCK antagonists. J Med Chem33:3199-204 (1991) Gastrin/cholecystokinin type B receptor
Name:Gastrin/cholecystokinin type B receptor
Type:G Protein-Coupled Receptor (GPCR)
Mol. Mass.:48445.79
Organism:Homo sapiens (Human)
Description:Stable expression of human CCK-2 receptors in HEK 293 cells.
Residue:447
BDBM50007930
NameBDBM50007930
Synonyms:3-{5-tert-Butoxycarbonylamino-2-[2-tert-butoxycarbonylamino-3-(1H-indol-3-yl)-propionylamino]-pentanoylamino}-succinamic acid | CHEMBL3142843
TypeSmall organic molecule
Emp. Form.C30H44N6O9
Mol. Mass.632.7052
SMILESCC(C)(C)OC(=O)NCCC[C@H](NC(=O)[C@H](Cc1c[nH]c2ccccc12)NC(=O)OC(C)(C)C)C(=O)N[C@@H](CC(O)=O)C(N)=O