Reaction Details
TargetGastrin/cholecystokinin type B receptor
LigandBDBM50228605
Substrate/Competitorn/a
Meas. Tech.ChEMBL_48091 (CHEMBL662288)
Ki 93±n/a nM
Citation Gonzalez-Muniz, RBergeron, FMarseigne, IDurieux, CRoques, BP Boc-Trp-Orn(Z)-Asp-NH2 and derivatives: a new family of CCK antagonists. J Med Chem33:3199-204 (1991) Gastrin/cholecystokinin type B receptor
Name:Gastrin/cholecystokinin type B receptor
Type:G Protein-Coupled Receptor (GPCR)
Mol. Mass.:48445.79
Organism:Homo sapiens (Human)
Description:Stable expression of human CCK-2 receptors in HEK 293 cells.
Residue:447
BDBM50228605
NameBDBM50228605
Synonyms:CHEMBL3350665
TypeSmall organic molecule
Emp. Form.C59H74N10O16S
Mol. Mass.1211.341
SMILESCCCC[C@H](NC(=O)[C@H](Cc1ccc(cc1)S(O)(=O)=O)NC(=O)OC(C)(C)C)C(=O)NCC(=O)N[C@@H](Cc1c[nH]c2ccccc12)C(=O)N[C@@H](CCCNC(=O)OCc1ccccc1)C(=O)N[C@@H](CC(O)=O)C(=O)N[C@@H](Cc1ccccc1)C(N)=O