Reaction Details
TargetNAD-dependent protein deacylase sirtuin-5, mitochondrial
LigandBDBM50255693
Substrate/Competitorn/a
Meas. Tech.ChEMBL_1687468 (CHEMBL4037947)
IC50 8750±n/a nM
Citation Kalbas, DLiebscher, SNowak, TMeleshin, MPannek, MPopp, CAlhalabi, ZBordusa, FSippl, WSteegborn, CSchutkowski, M Potent and Selective Inhibitors of Human Sirtuin 5. J Med Chem61:2460-2471 (2018) 
 
NAD-dependent protein deacylase sirtuin-5, mitochondrial
Name:NAD-dependent protein deacylase sirtuin-5, mitochondrial
Type:Protein
Mol. Mass.:33892.62
Organism:Homo sapiens (Human)
Description:Q9NXA8
Residue:310
BDBM50255693
NameBDBM50255693
Synonyms:CHEMBL4073655
TypeSmall organic molecule
Emp. Form.C58H83N11O16S
Mol. Mass.1222.409
SMILESCC(C)C[C@H](NC(=O)[C@@H](NC(=O)CNC(=O)c1ccccc1)C(C)C)C(=O)N[C@@H](CCCCNC(=O)C[C@H](SCCc1c(C)noc1C)C(O)=O)C(=O)N[C@@H](CCC(O)=O)C(=O)N[C@@H](Cc1ccc(O)cc1)C(=O)NCC(=O)N[C@@H](C(C)C)C(N)=O