Reaction Details
TargetMonoglyceride lipase
LigandBDBM50255786
Substrate/Competitorn/a
Meas. Tech.ChEBML_1687487
IC50 46±n/a nM
Citation McAllister, LAButler, CRMente, SO'Neil, SVFonseca, KRPiro, JRCianfrogna, JAFoley, TLGilbert, AMHarris, ARHelal, CJJohnson, DSMontgomery, JINason, DMNoell, SPandit, JRogers, BNSamad, TAShaffer, CLda Silva, RGUccello, DPWebb, DBrodney, MA Discovery of Trifluoromethyl Glycol Carbamates as Potent and Selective Covalent Monoacylglycerol Lipase (MAGL) Inhibitors for Treatment of Neuroinflammation. J Med Chem61:3008-3026 (2018) 
 
Monoglyceride lipase
Name:Monoglyceride lipase
Type:Hydrolase
Mol. Mass.:33264.56
Organism:Homo sapiens (Human)
Description:Human recombinant MGL (Cayman Chemical, cat# 10008354).
Residue:303
BDBM50255786
NameBDBM50255786
Synonyms:CHEMBL4076777
TypeSmall organic molecule
Emp. Form.C19H17FN4O4
Mol. Mass.384.3611
SMILES[H][C@@]12CN(C[C@]1([H])[C@H]2c1ccn(n1)-c1ccc(F)cc1)C(=O)ON1C(=O)CCC1=O