Reaction Details
TargetFatty-acid amide hydrolase 1
LigandBDBM50255775
Substrate/Competitorn/a
Meas. Tech.ChEBML_1687489
IC50 3100±n/a nM
Citation McAllister, LAButler, CRMente, SO'Neil, SVFonseca, KRPiro, JRCianfrogna, JAFoley, TLGilbert, AMHarris, ARHelal, CJJohnson, DSMontgomery, JINason, DMNoell, SPandit, JRogers, BNSamad, TAShaffer, CLda Silva, RGUccello, DPWebb, DBrodney, MA Discovery of Trifluoromethyl Glycol Carbamates as Potent and Selective Covalent Monoacylglycerol Lipase (MAGL) Inhibitors for Treatment of Neuroinflammation. J Med Chem61:3008-3026 (2018) 
 
Fatty-acid amide hydrolase 1
Name:Fatty-acid amide hydrolase 1
Type:Protein
Mol. Mass.:63071.19
Organism:Homo sapiens (Human)
Description:O00519
Residue:579
BDBM50255775
NameBDBM50255775
Synonyms:CHEMBL4079080
TypeSmall organic molecule
Emp. Form.C18H17F4N3O3
Mol. Mass.399.3395
SMILES[H][C@@]12CN(C[C@]1([H])[C@H]2c1ccn(n1)-c1ccc(F)cc1)C(=O)O[C@H](CO)C(F)(F)F