Reaction Details
TargetCytochrome P450 1A2
LigandBDBM50257041
Substrate/Competitorn/a
Meas. Tech.ChEBML_1688651
IC50 100±n/a nM
Citation Felts, ASRodriguez, ALBlobaum, ALMorrison, RDBates, BSThompson Gray, ARook, JMTantawy, MNByers, FWChang, SVenable, DFLuscombe, VBTamagnan, GDNiswender, CMDaniels, JSJones, CKConn, PJLindsley, CWEmmitte, KA Discovery of N-(5-Fluoropyridin-2-yl)-6-methyl-4-(pyrimidin-5-yloxy)picolinamide (VU0424238): A Novel Negative Allosteric Modulator of Metabotropic Glutamate Receptor Subtype 5 Selected for Clinical Evaluation. J Med Chem60:5072-5085 (2017) 
 
Cytochrome P450 1A2
Name:Cytochrome P450 1A2
Type:Enzyme
Mol. Mass.:58423.38
Organism:Homo sapiens (Human)
Description:P05177
Residue:516
BDBM50257041
NameBDBM50257041
Synonyms:CHEMBL4077672
TypeSmall organic molecule
Emp. Form.C17H12F2N4O2
Mol. Mass.342.2996
SMILESCc1cc(Oc2cncc(F)c2)cc(n1)C(=O)Nc1cccc(F)n1