Reaction Details
TargetMetabotropic glutamate receptor 5
LigandBDBM50257085
Substrate/Competitorn/a
Meas. Tech.ChEBML_1688692
IC50 48±n/a nM
Citation Felts, ASRodriguez, ALBlobaum, ALMorrison, RDBates, BSThompson Gray, ARook, JMTantawy, MNByers, FWChang, SVenable, DFLuscombe, VBTamagnan, GDNiswender, CMDaniels, JSJones, CKConn, PJLindsley, CWEmmitte, KA Discovery of N-(5-Fluoropyridin-2-yl)-6-methyl-4-(pyrimidin-5-yloxy)picolinamide (VU0424238): A Novel Negative Allosteric Modulator of Metabotropic Glutamate Receptor Subtype 5 Selected for Clinical Evaluation. J Med Chem60:5072-5085 (2017) 
 
Metabotropic glutamate receptor 5
Name:Metabotropic glutamate receptor 5
Type:Enzyme
Mol. Mass.:131900.14
Organism:Rattus norvegicus (Rat)
Description:P31424
Residue:1203
BDBM50257085
NameBDBM50257085
Synonyms:CHEMBL4070410
TypeSmall organic molecule
Emp. Form.C16H10F3N5O2
Mol. Mass.361.2781
SMILESFC(F)c1cc(Oc2cncnc2)cc(n1)C(=O)Nc1ccc(F)cn1