Reaction Details
TargetMetabotropic glutamate receptor 5
LigandBDBM50257043
Substrate/Competitorn/a
Meas. Tech.ChEMBL_1688644 (CHEMBL4039214)
IC50 33±n/a nM
Citation Felts, ASRodriguez, ALBlobaum, ALMorrison, RDBates, BSThompson Gray, ARook, JMTantawy, MNByers, FWChang, SVenable, DFLuscombe, VBTamagnan, GDNiswender, CMDaniels, JSJones, CKConn, PJLindsley, CWEmmitte, KA Discovery of N-(5-Fluoropyridin-2-yl)-6-methyl-4-(pyrimidin-5-yloxy)picolinamide (VU0424238): A Novel Negative Allosteric Modulator of Metabotropic Glutamate Receptor Subtype 5 Selected for Clinical Evaluation. J Med Chem60:5072-5085 (2017) 
 
Metabotropic glutamate receptor 5
Name:Metabotropic glutamate receptor 5
Type:Enzyme
Mol. Mass.:131900.14
Organism:Rattus norvegicus (Rat)
Description:P31424
Residue:1203
BDBM50257043
NameBDBM50257043
Synonyms:CHEMBL2386771
TypeSmall organic molecule
Emp. Form.C17H14FN5O2
Mol. Mass.339.3238
SMILESCc1cc(Oc2cnc(C)nc2)cc(n1)C(=O)Nc1ccc(F)cn1