Reaction Details
TargetAndrogen receptor
LigandBDBM50257273
Substrate/Competitorn/a
Meas. Tech.ChEMBL_1689751 (CHEMBL4040321)
IC50 59±n/a nM
Citation Unwalla, RMousseau, JJFadeyi, OOChoi, CParris, KHu, BKenney, TChippari, SMcNally, CVishwanathan, KKilbourne, EThompson, CNagpal, SWrobel, JYudt, MMorris, CAPowell, DGilbert, AMChekler, ELP Structure-Based Approach To Identify 5-[4-Hydroxyphenyl]pyrrole-2-carbonitrile Derivatives as Potent and Tissue Selective Androgen Receptor Modulators. J Med Chem60:6451-6457 (2017) 
 
Androgen receptor
Name:Androgen receptor
Type:Receptor
Mol. Mass.:99185.27
Organism:Homo sapiens (Human)
Description:CHO cells were stably transfected with human AR gene.
Residue:920
BDBM50257273
NameBDBM50257273
Synonyms:CHEMBL4068562
TypeSmall organic molecule
Emp. Form.C12H9FN2O
Mol. Mass.216.2111
SMILESCn1c(ccc1-c1ccc(O)c(F)c1)C#N