Reaction Details
TargetG protein-coupled receptor kinase 5
LigandBDBM50257340
Substrate/Competitorn/a
Meas. Tech.ChEBML_1689811
IC50 1500±n/a nM
Citation Okawa, TAramaki, YYamamoto, MKobayashi, TFukumoto, SToyoda, YHenta, THata, AIkeda, SKaneko, MHoffman, IDSang, BCZou, HKawamoto, T Design, Synthesis, and Evaluation of the Highly Selective and Potent G-Protein-Coupled Receptor Kinase 2 (GRK2) Inhibitor for the Potential Treatment of Heart Failure. J Med Chem60:6942-6990 (2017) 
 
G protein-coupled receptor kinase 5
Name:G protein-coupled receptor kinase 5
Type:PROTEIN
Mol. Mass.:67798.93
Organism:Homo sapiens (Human)
Description:ChEMBL_1280627
Residue:590
BDBM50257340
NameBDBM50257340
Synonyms:CHEMBL4072828
TypeSmall organic molecule
Emp. Form.C25H21F3N6O2
Mol. Mass.494.4684
SMILESFC(F)(F)c1ccccc1CNC(=O)c1cccc(NCc2nnc3-c4ccncc4OCCn23)c1