Reaction Details
TargetProtein kinase C alpha type
LigandBDBM50257401
Substrate/Competitorn/a
Meas. Tech.ChEBML_1689806
IC50>10000±n/a nM
Citation Okawa, TAramaki, YYamamoto, MKobayashi, TFukumoto, SToyoda, YHenta, THata, AIkeda, SKaneko, MHoffman, IDSang, BCZou, HKawamoto, T Design, Synthesis, and Evaluation of the Highly Selective and Potent G-Protein-Coupled Receptor Kinase 2 (GRK2) Inhibitor for the Potential Treatment of Heart Failure. J Med Chem60:6942-6990 (2017) 
 
Protein kinase C alpha type
Name:Protein kinase C alpha type
Type:Enzyme
Mol. Mass.:76755.65
Organism:Homo sapiens (Human)
Description:The recombinant human PKC enzymes were produced using a baculovirus expression system in SF9 cells
Residue:672
BDBM50257401
NameBDBM50257401
Synonyms:CHEMBL4062649
TypeSmall organic molecule
Emp. Form.C23H22N6O
Mol. Mass.398.4604
SMILESCc1cnccc1-c1n[nH]c(CNc2cccc(c2)C(=O)NCc2ccccc2)n1