Reaction Details
TargetBeta-adrenergic receptor kinase 1
LigandBDBM50257343
Substrate/Competitorn/a
Meas. Tech.ChEMBL_1689808 (CHEMBL4040378)
EC50 3000±n/a nM
Citation Okawa, TAramaki, YYamamoto, MKobayashi, TFukumoto, SToyoda, YHenta, THata, AIkeda, SKaneko, MHoffman, IDSang, BCZou, HKawamoto, T Design, Synthesis, and Evaluation of the Highly Selective and Potent G-Protein-Coupled Receptor Kinase 2 (GRK2) Inhibitor for the Potential Treatment of Heart Failure. J Med Chem60:6942-6990 (2017) 
 
Beta-adrenergic receptor kinase 1
Name:Beta-adrenergic receptor kinase 1
Type:Enzyme
Mol. Mass.:79581.30
Organism:Homo sapiens (Human)
Description:P25098
Residue:689
BDBM50257343
NameBDBM50257343
Synonyms:CHEMBL4086046
TypeSmall organic molecule
Emp. Form.C25H24F3N7O
Mol. Mass.495.4996
SMILESCCCn1c(CNc2cccc(c2)C(=O)NCc2ccccc2C(F)(F)F)nnc1-c1ccncn1