Reaction Details
TargetBeta-adrenergic receptor kinase 1
LigandBDBM50173313
Substrate/Competitorn/a
Meas. Tech.ChEBML_1689808
IC50 1.2±n/a nM
Citation Okawa, TAramaki, YYamamoto, MKobayashi, TFukumoto, SToyoda, YHenta, THata, AIkeda, SKaneko, MHoffman, IDSang, BCZou, HKawamoto, T Design, Synthesis, and Evaluation of the Highly Selective and Potent G-Protein-Coupled Receptor Kinase 2 (GRK2) Inhibitor for the Potential Treatment of Heart Failure. J Med Chem60:6942-6990 (2017) 
 
Beta-adrenergic receptor kinase 1
Name:Beta-adrenergic receptor kinase 1
Type:Enzyme
Mol. Mass.:79581.30
Organism:Homo sapiens (Human)
Description:P25098
Residue:689
BDBM50173313
NameBDBM50173313
Synonyms:CHEMBL1738878
TypeSmall organic molecule
Emp. Form.C24H23F2N7O
Mol. Mass.463.4825
SMILESCCCn1c(CNc2cccc(c2)C(=O)NCc2c(F)cccc2F)nnc1-c1ccncn1