Reaction Details
TargetRho-associated protein kinase 2
LigandBDBM50257344
Substrate/Competitorn/a
Meas. Tech.ChEBML_1689804
IC50 23±n/a nM
Citation Okawa, TAramaki, YYamamoto, MKobayashi, TFukumoto, SToyoda, YHenta, THata, AIkeda, SKaneko, MHoffman, IDSang, BCZou, HKawamoto, T Design, Synthesis, and Evaluation of the Highly Selective and Potent G-Protein-Coupled Receptor Kinase 2 (GRK2) Inhibitor for the Potential Treatment of Heart Failure. J Med Chem60:6942-6990 (2017) 
 
Rho-associated protein kinase 2
Name:Rho-associated protein kinase 2
Type:Protein
Mol. Mass.:160885.43
Organism:Homo sapiens (Human)
Description:O75116
Residue:1388
BDBM50257344
NameBDBM50257344
Synonyms:CHEMBL4065690
TypeSmall organic molecule
Emp. Form.C24H23N5O
Mol. Mass.397.4723
SMILESCc1c(CNc2cccc(c2)C(=O)NCc2ccccc2)[nH]nc1-c1ccncc1