Reaction Details
TargetG protein-coupled receptor kinase 5
LigandBDBM50257350
Substrate/Competitorn/a
Meas. Tech.ChEBML_1689811
IC50 2300±n/a nM
Citation Okawa, TAramaki, YYamamoto, MKobayashi, TFukumoto, SToyoda, YHenta, THata, AIkeda, SKaneko, MHoffman, IDSang, BCZou, HKawamoto, T Design, Synthesis, and Evaluation of the Highly Selective and Potent G-Protein-Coupled Receptor Kinase 2 (GRK2) Inhibitor for the Potential Treatment of Heart Failure. J Med Chem60:6942-6990 (2017) 
 
G protein-coupled receptor kinase 5
Name:G protein-coupled receptor kinase 5
Type:PROTEIN
Mol. Mass.:67798.93
Organism:Homo sapiens (Human)
Description:ChEMBL_1280627
Residue:590
BDBM50257350
NameBDBM50257350
Synonyms:CHEMBL1738877
TypeSmall organic molecule
Emp. Form.C24H21F3N6O
Mol. Mass.466.4583
SMILESCn1c(CNc2cccc(c2)C(=O)NCc2ccccc2C(F)(F)F)nnc1-c1ccncc1