Reaction Details
TargetInhibitor of nuclear factor kappa-B kinase subunit alpha
LigandBDBM50257863
Substrate/Competitorn/a
Meas. Tech.ChEBML_1690028
Ki 1500±n/a nM
Citation Anthony, NGBaiget, JBerretta, GBoyd, MBreen, DEdwards, JGamble, CGray, AIHarvey, ALHatziieremia, SHo, KHHuggan, JKLang, SLlona-Minguez, SLuo, JLMcIntosh, KPaul, APlevin, RJRobertson, MNScott, RSuckling, CJSutcliffe, OBYoung, LCMackay, SP Inhibitory Kappa B Kinase? (IKK?) Inhibitors That Recapitulate Their Selectivity in Cells against Isoform-Related Biomarkers. J Med Chem60:7043-7066 (2017) 
 
Inhibitor of nuclear factor kappa-B kinase subunit alpha
Name:Inhibitor of nuclear factor kappa-B kinase subunit alpha
Type:PROTEIN
Mol. Mass.:84642.21
Organism:Homo sapiens (Human)
Description:ChEMBL_327453
Residue:745
BDBM50257863
NameBDBM50257863
Synonyms:CHEMBL4068933
TypeSmall organic molecule
Emp. Form.C12H10N4O2S
Mol. Mass.274.298
SMILESNS(=O)(=O)c1ccc(cc1)-c1ncnc2[nH]ccc12