Reaction Details
TargetInhibitor of nuclear factor kappa-B kinase subunit beta
LigandBDBM50257883
Substrate/Competitorn/a
Meas. Tech.ChEBML_1690031
Ki>30000±n/a nM
Citation Anthony, NGBaiget, JBerretta, GBoyd, MBreen, DEdwards, JGamble, CGray, AIHarvey, ALHatziieremia, SHo, KHHuggan, JKLang, SLlona-Minguez, SLuo, JLMcIntosh, KPaul, APlevin, RJRobertson, MNScott, RSuckling, CJSutcliffe, OBYoung, LCMackay, SP Inhibitory Kappa B Kinase? (IKK?) Inhibitors That Recapitulate Their Selectivity in Cells against Isoform-Related Biomarkers. J Med Chem60:7043-7066 (2017) 
 
Inhibitor of nuclear factor kappa-B kinase subunit beta
Name:Inhibitor of nuclear factor kappa-B kinase subunit beta
Type:Serine/threonine-protein kinase
Mol. Mass.:86554.39
Organism:Homo sapiens (Human)
Description:GST-tagged IKK-2 was expressed in High Five cells and purified.
Residue:756
BDBM50257883
NameBDBM50257883
Synonyms:CHEMBL4087123
TypeSmall organic molecule
Emp. Form.C12H14N6O
Mol. Mass.258.2792
SMILESNc1nc(N2CCC[C@@H]2CO)c2c(c[nH]c2n1)C#N