Reaction Details
TargetAcetylcholinesterase
LigandBDBM50008563
Substrate/Competitorn/a
Meas. Tech.ChEMBL_29409 (CHEMBL643382)
IC50 4900±n/a nM
Citation Cardozo, MGIimura, YSugimoto, HYamanishi, YHopfinger, AJ QSAR analyses of the substituted indanone and benzylpiperidine rings of a series of indanone-benzylpiperidine inhibitors of acetylcholinesterase. J Med Chem35:584-9 (1992) Acetylcholinesterase
Name:Acetylcholinesterase
Type:Enzyme
Mol. Mass.:67792.70
Organism:Homo sapiens (Human)
Description:P22303
Residue:614
BDBM50008563
NameBDBM50008563
Synonyms:3-nitrotoluene | CHEMBL114059
TypeSmall organic molecule
Emp. Form.C7H7NO2
Mol. Mass.137.136
SMILESCc1cccc(c1)[N+]([O-])=O