Reaction Details
TargetAcetylcholinesterase
LigandBDBM50008568
Substrate/Competitorn/a
Meas. Tech.ChEBML_29413
IC50 4.2±n/a nM
Citation Cardozo, MGKawai, TIimura, YSugimoto, HYamanishi, YHopfinger, AJ Conformational analyses and molecular-shape comparisons of a series of indanone-benzylpiperidine inhibitors of acetylcholinesterase. J Med Chem35:590-601 (1992) Acetylcholinesterase
Name:Acetylcholinesterase
Type:Enzyme
Mol. Mass.:67792.70
Organism:Homo sapiens (Human)
Description:P22303
Residue:614
BDBM50008568
NameBDBM50008568
Synonyms:3-[2-(1-Methyl-piperidin-4-yl)-ethyl]-1H-quinoline-2,4-dione | CHEMBL158252
TypeSmall organic molecule
Emp. Form.C17H22N2O2
Mol. Mass.286.3688
SMILESCN1CCC(CCc2c(O)c3ccccc3[nH]c2=O)CC1