Reaction Details
TargetAcetylcholinesterase
LigandBDBM50008579
Substrate/Competitorn/a
Meas. Tech.ChEBML_29413
IC50 5.3±n/a nM
Citation Cardozo, MGKawai, TIimura, YSugimoto, HYamanishi, YHopfinger, AJ Conformational analyses and molecular-shape comparisons of a series of indanone-benzylpiperidine inhibitors of acetylcholinesterase. J Med Chem35:590-601 (1992) Acetylcholinesterase
Name:Acetylcholinesterase
Type:Enzyme
Mol. Mass.:67792.70
Organism:Homo sapiens (Human)
Description:P22303
Residue:614
BDBM50008579
NameBDBM50008579
Synonyms:1-Benzyl-4-methyl-piperidine | CHEMBL158232
TypeSmall organic molecule
Emp. Form.C13H19N
Mol. Mass.189.2967
SMILESCC1CCN(Cc2ccccc2)CC1