Reaction Details
TargetAcetylcholinesterase
LigandBDBM50008584
Substrate/Competitorn/a
Meas. Tech.ChEBML_29413
IC50 3±n/a nM
Citation Cardozo, MGKawai, TIimura, YSugimoto, HYamanishi, YHopfinger, AJ Conformational analyses and molecular-shape comparisons of a series of indanone-benzylpiperidine inhibitors of acetylcholinesterase. J Med Chem35:590-601 (1992) Acetylcholinesterase
Name:Acetylcholinesterase
Type:Enzyme
Mol. Mass.:67792.70
Organism:Homo sapiens (Human)
Description:P22303
Residue:614
BDBM50008584
NameBDBM50008584
Synonyms:2-[3-(1-Methyl-piperidin-4-yl)-allylidene]-indan-1-one | CHEMBL155746
TypeSmall organic molecule
Emp. Form.C18H21NO
Mol. Mass.267.3654
SMILESCN1CCC(CC1)\C=C\C=C1/Cc2ccccc2C1=O