Reaction Details
TargetAdenosine receptor A3
LigandBDBM50258891
Substrate/Competitorn/a
Meas. Tech.ChEBML_1690747
Ki 2.8±n/a nM
Citation Azuaje, JJespers, WYaziji, VMallo, AMajellaro, MCaamaño, OLoza, MICadavid, MIBrea, JÅqvist, JSotelo, EGutiérrez-de-Terán, H Effect of Nitrogen Atom Substitution in A J Med Chem60:7502-7511 (2017) 
 
Adenosine receptor A3
Name:Adenosine receptor A3
Type:G Protein-Coupled Receptor (GPCR)
Mol. Mass.:36197.32
Organism:Homo sapiens (Human)
Description:P0DMS8
Residue:318
BDBM50258891
NameBDBM50258891
Synonyms:CHEMBL4067466
TypeSmall organic molecule
Emp. Form.C21H16N2O5
Mol. Mass.376.3621
SMILESCC(=O)Nc1cc(cc(n1)-c1ccc2OCOc2c1)-c1ccc2OCOc2c1