Reaction Details
TargetcGMP-dependent 3',5'-cyclic phosphodiesterase
LigandBDBM107767
Substrate/Competitorn/a
Meas. Tech.ChEMBL_1690806 (CHEMBL4041376)
IC50 1.000000±n/a nM
Citation Mikami, SNakamura, SAshizawa, TNomura, IKawasaki, MSasaki, SOki, HKokubo, HHoffman, IDZou, HUchiyama, NNakashima, KKamiguchi, NImada, HSuzuki, NIwashita, HTaniguchi, T Discovery of Clinical Candidate N-((1S)-1-(3-Fluoro-4-(trifluoromethoxy)phenyl)-2-methoxyethyl)-7-methoxy-2-oxo-2,3-dihydropyrido[2,3-b]pyrazine-4(1H)-carboxamide (TAK-915): A Highly Potent, Selective, and Brain-Penetrating Phosphodiesterase 2A Inhibitor for the Treatment of Cognitive Disorders. J Med Chem60:7677-7702 (2017) 
 
cGMP-dependent 3',5'-cyclic phosphodiesterase
Name:cGMP-dependent 3',5'-cyclic phosphodiesterase
Type:Enzyme Catalytic Domain
Mol. Mass.:105691.58
Organism:Homo sapiens (Human)
Description:O00408
Residue:941
BDBM107767
NameBDBM107767
Synonyms:US11419874, PF-05180999 | US8598155, 2
TypeSmall organic molecule
Emp. Form.C19H17F3N8
Mol. Mass.414.3871
SMILESCc1nc(-c2cnn(C)c2-c2ccc(cn2)C(F)(F)F)c2c(ncnn12)N1CCC1