Reaction Details
TargetProstaglandin E synthase
LigandBDBM50259026
Substrate/Competitorn/a
Meas. Tech.ChEBML_1691107
IC50 4600±n/a nM
Citation Lauro, GManfra, MPedatella, SFischer, KCantone, VTerracciano, SBertamino, AOstacolo, CGomez-Monterrey, IDe Nisco, MRiccio, RNovellino, EWerz, OCampiglia, PBifulco, G Identification of novel microsomal prostaglandin E Eur J Med Chem125:278-287 (2017) 
 
Prostaglandin E synthase
Name:Prostaglandin E synthase
Type:Protein
Mol. Mass.:17112.22
Organism:Homo sapiens (Human)
Description:n/a
Residue:152
BDBM50259026
NameBDBM50259026
Synonyms:CHEMBL4074135
TypeSmall organic molecule
Emp. Form.C18H8N4O4
Mol. Mass.344.2805
SMILESO=C(Oc1cccc2-c3nc4nonc4nc3C(=O)c12)c1ccccc1