Reaction Details
TargetKappa-type opioid receptor
LigandBDBM50000278
Substrate/Competitorn/a
Meas. Tech.ChEMBL_146654 (CHEMBL754938)
Ki 0.480000±n/a nM
Citation Vecchietti, VGiordani, AGiardina, GColle, RClarke, GD (2S)-1-(arylacetyl)-2-(aminomethyl)piperidine derivatives: novel, highly selective kappa opioid analgesics. J Med Chem34:397-403 (1991) Kappa-type opioid receptor
Name:Kappa-type opioid receptor
Type:G Protein-Coupled Receptor (GPCR)
Mol. Mass.:42744.99
Organism:Cavia porcellus (domestic guinea pig)
Description:P41144
Residue:380
BDBM50000278
NameBDBM50000278
Synonyms:2-(3,4-Dichloro-phenyl)-1-(2-piperidin-1-ylmethyl-piperidin-1-yl)-ethanone CHEMBL131328
TypeSmall organic molecule
Emp. Form.C19H26Cl2N2O
Mol. Mass.369.329
SMILESClc1ccc(CC(=O)N2CCCCC2CN2CCCCC2)cc1Cl