Reaction Details
TargetMu-type opioid receptor
LigandBDBM50000296
Substrate/Competitorn/a
Meas. Tech.ChEMBL_146259 (CHEMBL757483)
Ki 616±n/a nM
Citation Vecchietti, VGiordani, AGiardina, GColle, RClarke, GD (2S)-1-(arylacetyl)-2-(aminomethyl)piperidine derivatives: novel, highly selective kappa opioid analgesics. J Med Chem34:397-403 (1991) Mu-type opioid receptor
Name:Mu-type opioid receptor
Type:Enzyme Catalytic Domain
Mol. Mass.:11165.58
Organism:GUINEA PIG
Description:P97266
Residue:98
BDBM50000296
NameBDBM50000296
Synonyms:CHEMBL441765 U-50488H | US11492374, ID 1
TypeSmall organic molecule
Emp. Form.C19H26Cl2N2O
Mol. Mass.369.329
SMILESCN([C@@H]1CCCC[C@H]1N1CCCC1)C(=O)Cc1ccc(Cl)c(Cl)c1