Reaction Details
TargetKappa-type opioid receptor
LigandBDBM50008889
Substrate/Competitorn/a
Meas. Tech.ChEBML_146536
Ki 1000±n/a nM
Citation Vecchietti, VGiordani, AGiardina, GColle, RClarke, GD (2S)-1-(arylacetyl)-2-(aminomethyl)piperidine derivatives: novel, highly selective kappa opioid analgesics. J Med Chem34:397-403 (1991) Kappa-type opioid receptor
Name:Kappa-type opioid receptor
Type:G Protein-Coupled Receptor (GPCR)
Mol. Mass.:42744.99
Organism:Cavia porcellus (domestic guinea pig)
Description:P41144
Residue:380
BDBM50008889
NameBDBM50008889
Synonyms:(threo)2-(3,4-Dichloro-phenyl)-1-[2-(1-dimethylamino-ethyl)-piperidin-1-yl]-ethanone(HCl) CHEMBL131034
TypeSmall organic molecule
Emp. Form.C17H24Cl2N2O
Mol. Mass.343.291
SMILESCC(C1CCCCN1C(=O)Cc1ccc(Cl)c(Cl)c1)N(C)C