Reaction Details
TargetKappa-type opioid receptor
LigandBDBM50452995
Substrate/Competitorn/a
Meas. Tech.ChEBML_146536
Ki 0.700000±n/a nM
Citation Vecchietti, VGiordani, AGiardina, GColle, RClarke, GD (2S)-1-(arylacetyl)-2-(aminomethyl)piperidine derivatives: novel, highly selective kappa opioid analgesics. J Med Chem34:397-403 (1991) Kappa-type opioid receptor
Name:Kappa-type opioid receptor
Type:G Protein-Coupled Receptor (GPCR)
Mol. Mass.:42744.99
Organism:Cavia porcellus (domestic guinea pig)
Description:P41144
Residue:380
BDBM50452995
NameBDBM50452995
Synonyms:CHEMBL2111856
TypeSmall organic molecule
Emp. Form.C16H22Cl2N2O
Mol. Mass.329.265
SMILESCN(C)C[C@@H]1CCCCN1C(=O)Cc1ccc(Cl)c(Cl)c1