Reaction Details
TargetKappa-type opioid receptor
LigandBDBM50008895
Substrate/Competitorn/a
Meas. Tech.ChEMBL_145225 (CHEMBL755522)
Ki 0.570000±n/a nM
Citation Vecchietti, VGiordani, AGiardina, GColle, RClarke, GD (2S)-1-(arylacetyl)-2-(aminomethyl)piperidine derivatives: novel, highly selective kappa opioid analgesics. J Med Chem34:397-403 (1991) Kappa-type opioid receptor
Name:Kappa-type opioid receptor
Type:G Protein-Coupled Receptor (GPCR)
Mol. Mass.:42744.99
Organism:Cavia porcellus (domestic guinea pig)
Description:P41144
Residue:380
BDBM50008895
NameBDBM50008895
Synonyms:1-(2-Pyrrolidin-1-ylmethyl-piperidin-1-yl)-2-(4-trifluoromethyl-phenyl)-ethanone(HCl) | CHEMBL128542
TypeSmall organic molecule
Emp. Form.C19H25F3N2O
Mol. Mass.354.4098
SMILESFC(F)(F)c1ccc(CC(=O)N2CCCCC2CN2CCCC2)cc1