Reaction Details
TargetKappa-type opioid receptor
LigandBDBM50008888
Substrate/Competitorn/a
Meas. Tech.ChEMBL_145225 (CHEMBL755522)
Ki 0.330±n/a nM
Citation Vecchietti, VGiordani, AGiardina, GColle, RClarke, GD (2S)-1-(arylacetyl)-2-(aminomethyl)piperidine derivatives: novel, highly selective kappa opioid analgesics. J Med Chem34:397-403 (1991) Kappa-type opioid receptor
Name:Kappa-type opioid receptor
Type:G Protein-Coupled Receptor (GPCR)
Mol. Mass.:42744.99
Organism:Cavia porcellus (domestic guinea pig)
Description:P41144
Residue:380
BDBM50008888
NameBDBM50008888
Synonyms:(threo)2-(3,4-Dichloro-phenyl)-1-[2-(1-methyl-pyrrolidin-2-yl)-piperidin-1-yl]-ethanone(HCl) CHEMBL130272
TypeSmall organic molecule
Emp. Form.C18H24Cl2N2O
Mol. Mass.355.302
SMILESCN1CCCC1C1CCCCN1C(=O)Cc1ccc(Cl)c(Cl)c1