Reaction Details
TargetHistamine H4 receptor
LigandBDBM50325744
Substrate/Competitorn/a
Meas. Tech.ChEMBL_1691275 (CHEMBL4041924)
Ki 125±n/a nM
Citation Levoin, NLabeeuw, OBillot, XCalmels, TDanvy, DKrief, SBerrebi-Bertrand, ILecomte, JMSchwartz, JCCapet, M Discovery of nanomolar ligands with novel scaffolds for the histamine H4 receptor by virtual screening. Eur J Med Chem125:565-572 (2017) 
 
Histamine H4 receptor
Name:Histamine H4 receptor
Type:G Protein-Coupled Receptor (GPCR)
Mol. Mass.:44517.02
Organism:Homo sapiens (Human)
Description:Binding assays were using CHO cells stably expressing hH4R receptors.
Residue:390
BDBM50325744
NameBDBM50325744
Synonyms:CHEMBL1223683 | N-(4-(4-(2,3-dichlorophenyl)piperazin-1-yl)butyl)quinolin-2-amine
TypeSmall organic molecule
Emp. Form.C23H26Cl2N4
Mol. Mass.429.385
SMILESClc1cccc(N2CCN(CCCCNc3ccc4ccccc4n3)CC2)c1Cl