Reaction Details
TargetD(3) dopamine receptor
LigandBDBM50325748
Substrate/Competitorn/a
Meas. Tech.ChEBML_1691277
Ki 1.000000±n/a nM
Citation Levoin, NLabeeuw, OBillot, XCalmels, TDanvy, DKrief, SBerrebi-Bertrand, ILecomte, JMSchwartz, JCCapet, M Discovery of nanomolar ligands with novel scaffolds for the histamine H4 receptor by virtual screening. Eur J Med Chem125:565-572 (2017) 
 
D(3) dopamine receptor
Name:D(3) dopamine receptor
Type:n/a
Mol. Mass.:44243.43
Organism:Homo sapiens (Human)
Description:n/a
Residue:400
BDBM50325748
NameBDBM50325748
Synonyms:CHEMBL1223750 | N-(4-(4-(3-(trifluoromethyl)phenyl)piperazin-1-yl)butyl)isoquinolin-1-amine
TypeSmall organic molecule
Emp. Form.C24H27F3N4
Mol. Mass.428.4932
SMILESFC(F)(F)c1cccc(c1)N1CCN(CCCCNc2nccc3ccccc23)CC1