Reaction Details
TargetHistamine H3 receptor
LigandBDBM50259257
Substrate/Competitorn/a
Meas. Tech.ChEBML_1691278
Ki 14±n/a nM
Citation Levoin, NLabeeuw, OBillot, XCalmels, TDanvy, DKrief, SBerrebi-Bertrand, ILecomte, JMSchwartz, JCCapet, M Discovery of nanomolar ligands with novel scaffolds for the histamine H4 receptor by virtual screening. Eur J Med Chem125:565-572 (2017) 
 
Histamine H3 receptor
Name:Histamine H3 receptor
Type:G Protein-Coupled Receptor (GPCR)
Mol. Mass.:48691.47
Organism:Homo sapiens (Human)
Description:Binding assays were using CHO cells stably expressing hH3R receptors.
Residue:445
BDBM50259257
NameBDBM50259257
Synonyms:CHEMBL4065099
TypeSmall organic molecule
Emp. Form.C19H19IN2O
Mol. Mass.418.2714
SMILESIc1ccc(cc1)C(OCCCc1c[nH]cn1)c1ccccc1