Reaction Details
TargetHistamine H4 receptor
LigandBDBM50259267
Substrate/Competitorn/a
Meas. Tech.ChEMBL_1691275 (CHEMBL4041924)
Ki 3800±n/a nM
Citation Levoin, NLabeeuw, OBillot, XCalmels, TDanvy, DKrief, SBerrebi-Bertrand, ILecomte, JMSchwartz, JCCapet, M Discovery of nanomolar ligands with novel scaffolds for the histamine H4 receptor by virtual screening. Eur J Med Chem125:565-572 (2017) 
 
Histamine H4 receptor
Name:Histamine H4 receptor
Type:G Protein-Coupled Receptor (GPCR)
Mol. Mass.:44517.02
Organism:Homo sapiens (Human)
Description:Binding assays were using CHO cells stably expressing hH4R receptors.
Residue:390
BDBM50259267
NameBDBM50259267
Synonyms:CHEMBL4099779
TypeSmall organic molecule
Emp. Form.C27H34FN3O3
Mol. Mass.467.5756
SMILESCOc1cc2CC(C(=O)NCCCCN3CCN(CC3)c3ccccc3F)=C(C)c2cc1OC