Reaction Details
TargetHistamine H4 receptor
LigandBDBM50259249
Substrate/Competitorn/a
Meas. Tech.ChEMBL_1691274 (CHEMBL4041923)
Ki 14±n/a nM
Citation Levoin, NLabeeuw, OBillot, XCalmels, TDanvy, DKrief, SBerrebi-Bertrand, ILecomte, JMSchwartz, JCCapet, M Discovery of nanomolar ligands with novel scaffolds for the histamine H4 receptor by virtual screening. Eur J Med Chem125:565-572 (2017) 
 
Histamine H4 receptor
Name:Histamine H4 receptor
Type:G Protein-Coupled Receptor (GPCR)
Mol. Mass.:44517.02
Organism:Homo sapiens (Human)
Description:Binding assays were using CHO cells stably expressing hH4R receptors.
Residue:390
BDBM50259249
NameBDBM50259249
Synonyms:CHEMBL4095224
TypeSmall organic molecule
Emp. Form.C20H19Cl2N3O2
Mol. Mass.404.29
SMILESClc1ccc(cc1)C(NC(=O)OCCCc1c[nH]cn1)c1ccc(Cl)cc1