Reaction Details
TargetHistamine H4 receptor
LigandBDBM50146144
Substrate/Competitorn/a
Meas. Tech.ChEMBL_1691275 (CHEMBL4041924)
Ki 240±n/a nM
Citation Levoin, NLabeeuw, OBillot, XCalmels, TDanvy, DKrief, SBerrebi-Bertrand, ILecomte, JMSchwartz, JCCapet, M Discovery of nanomolar ligands with novel scaffolds for the histamine H4 receptor by virtual screening. Eur J Med Chem125:565-572 (2017) 
 
Histamine H4 receptor
Name:Histamine H4 receptor
Type:G Protein-Coupled Receptor (GPCR)
Mol. Mass.:44517.02
Organism:Homo sapiens (Human)
Description:Binding assays were using CHO cells stably expressing hH4R receptors.
Residue:390
BDBM50146144
NameBDBM50146144
Synonyms:4-(3-Trityloxy-propyl)-1H-imidazole | CHEMBL91576
TypeSmall organic molecule
Emp. Form.C25H24N2O
Mol. Mass.368.4709
SMILESC(COC(c1ccccc1)(c1ccccc1)c1ccccc1)Cc1cnc[nH]1