Reaction Details
TargetHistamine H4 receptor
LigandBDBM50050165
Substrate/Competitorn/a
Meas. Tech.ChEMBL_1691275 (CHEMBL4041924)
Ki 118±n/a nM
Citation Levoin, NLabeeuw, OBillot, XCalmels, TDanvy, DKrief, SBerrebi-Bertrand, ILecomte, JMSchwartz, JCCapet, M Discovery of nanomolar ligands with novel scaffolds for the histamine H4 receptor by virtual screening. Eur J Med Chem125:565-572 (2017) 
 
Histamine H4 receptor
Name:Histamine H4 receptor
Type:G Protein-Coupled Receptor (GPCR)
Mol. Mass.:44517.02
Organism:Homo sapiens (Human)
Description:Binding assays were using CHO cells stably expressing hH4R receptors.
Residue:390
BDBM50050165
NameBDBM50050165
Synonyms:4-(4-Iodo-phenyl)-butyric acid 3-(1H-imidazol-4-yl)-propyl ester | CHEMBL20338
TypeSmall organic molecule
Emp. Form.C16H19IN2O2
Mol. Mass.398.2387
SMILESIc1ccc(CCCC(=O)OCCCc2cnc[nH]2)cc1