Reaction Details
TargetHistamine H4 receptor
LigandBDBM50259264
Substrate/Competitorn/a
Meas. Tech.ChEMBL_1691274 (CHEMBL4041923)
Ki 27±n/a nM
Citation Levoin, NLabeeuw, OBillot, XCalmels, TDanvy, DKrief, SBerrebi-Bertrand, ILecomte, JMSchwartz, JCCapet, M Discovery of nanomolar ligands with novel scaffolds for the histamine H4 receptor by virtual screening. Eur J Med Chem125:565-572 (2017) 
 
Histamine H4 receptor
Name:Histamine H4 receptor
Type:G Protein-Coupled Receptor (GPCR)
Mol. Mass.:44517.02
Organism:Homo sapiens (Human)
Description:Binding assays were using CHO cells stably expressing hH4R receptors.
Residue:390
BDBM50259264
NameBDBM50259264
Synonyms:CHEMBL4100315
TypeSmall organic molecule
Emp. Form.C21H24N2O
Mol. Mass.320.4281
SMILESC(COCCCc1ccc(cc1)-c1ccccc1)Cc1c[nH]cn1